BDBM212137 US9290485, 169
SMILES Cc1cn2cc(Cn3cc(cn3)C(=O)NCc3c(C)cc(N)nc3C)ccc2n1
InChI Key InChIKey=XFBVLADKLOFZNC-UHFFFAOYSA-N
Data  1 IC50
  Tab Delimited (TSV)   2D SDfile   Computed 3D by Vconf -m prep SDfile
Find this compound or compounds like it in BindingDB:
Activity Spreadsheet -- Enzyme Inhibition Constant Data from BindingDB
Found 1 hit for monomerid = 212137
TargetPlasma kallikrein(Homo sapiens (Human))
Novartis
US Patent
LigandPNGBDBM212137(US9290485, 169)
Affinity DataIC50:  3nMpH: 7.8 T: 2°C. Assay description: Enzymatic reactions were conducted in â¿¿assay bufferâ¿¿, comprising 50 mM Hepes/NaOH at pH 7.8, 150 mM NaCl, 1 mM EDTA and 0.05% (w/v) CHAPS. For th...
Ligand InfoPC cidPC sid
In DepthDetails US Patent