BDBM212384 US9550778, chem-us-00226
SMILES Cc1cc([nH]n1)-c1cc(C(=O)Nc2ccc(C)cn2)c2nccn2c1
InChI Key InChIKey=KZCBGLOVGZHOOO-UHFFFAOYSA-N
Data  1 IC50
  Tab Delimited (TSV)   2D SDfile   Computed 3D by Vconf -m prep SDfile
Find this compound or compounds like it in BindingDB:
Activity Spreadsheet -- Enzyme Inhibition Constant Data from BindingDB
Found 1 hit for monomerid = 212384
TargetMetabotropic glutamate receptor 5(Rattus norvegicus (Rat))
Vanderbilt University
US Patent
LigandPNGBDBM212384(US9550778, chem-us-00226)
Affinity DataIC50:  5.11E+3nMpH: 7.4 T: 2°C. Assay description: The following examples of the in vitro effects of the disclosed compounds are prophetic. An example of an in vitro assay method for assessing the rec...
Ligand InfoPC cidPC sid
In DepthDetails US Patent