BDBM212443 US9278093, 3
SMILES CC(C)c1c(F)cncc1-c1cc(F)c-2c(CCc3nnc(C)n-23)c1
InChI Key InChIKey=KGAFNYRYMCYLBY-UHFFFAOYSA-N
Data  2 IC50
  Tab Delimited (TSV)   2D SDfile   Computed 3D by Vconf -m prep SDfile
Find this compound or compounds like it in BindingDB:
Activity Spreadsheet -- Enzyme Inhibition Constant Data from BindingDB
Found 2 hits for monomerid = 212443
TargetCytochrome P450 11B1, mitochondrial(Homo sapiens (Human))
Merck Sharp & Dohme
US Patent
LigandPNGBDBM212443(US9278093, 3)
Affinity DataIC50:  3.97E+3nMT: 2°C. Assay description: Compounds of the Examples 1 to 3 were assayed for V79-Human-CYP11B2 and V79-Human-CYP11B1 by modifying the protocol described in J. Steroid Biochem. ...
Ligand InfoPC cidPC sid
In DepthDetails US Patent
TargetCytochrome P450 11B2, mitochondrial(Homo sapiens (Human))
Merck Sharp & Dohme
US Patent
LigandPNGBDBM212443(US9278093, 3)
Affinity DataIC50:  9.5nMT: 2°C. Assay description: Compounds of the Examples 1 to 3 were assayed for V79-Human-CYP11B2 and V79-Human-CYP11B1 by modifying the protocol described in J. Steroid Biochem. ...
Ligand InfoPC cidPC sid
In DepthDetails US Patent