BDBM21537 (benzyloxy)({[(2S,3R,4S,5R,6R)-5-hydroxy-6-(hydroxymethyl)-4-[(4-methylbenzene)amido]-2-(methylsulfanyl)oxan-3-yl]oxy})phosphinic acid::Galactose-Derived Compound 15
SMILES CS[C@@H]1O[C@H](CO)[C@H](O)[C@H](NC(=O)c2ccc(C)cc2)[C@H]1OP(O)(=O)OCc1ccccc1
InChI Key InChIKey=IDAWZVIHHBVHNS-QWPXSNKBSA-N
Data  2 Kd
PDB links: 1 PDB ID matches this monomer.
  Tab Delimited (TSV)   2D SDfile   Computed 3D by Vconf -m prep SDfile
Find this compound or compounds like it in BindingDB:
Activity Spreadsheet -- Enzyme Inhibition Constant Data from BindingDB
Found 2 hits for monomerid = 21537
TargetGalectin-7(Homo sapiens (Human))
Henan University Of Chinese Medicine
Curated by ChEMBL
LigandPNGBDBM21537((benzyloxy)({[(2S,3R,4S,5R,6R)-5-hydroxy-6-(hydrox...)
Affinity DataKd:  4.50E+5nM. Assay description: Binding affinity to human Gal-7 assessed as dissociation constant by fluorescence polarization assay
TargetGalectin-3(Homo sapiens (Human))
Lund University
LigandPNGBDBM21537((benzyloxy)({[(2S,3R,4S,5R,6R)-5-hydroxy-6-(hydrox...)
Affinity DataKd:  1.20E+5nMpH: 7.2 T: 2°C. Assay description: In fluorescence polarization measurements, a fluorescent probe was excited with plane-polarized light and the degree of polarization remaining in the...
In DepthDetails ArticlePubMed