BDBM22003 5-(ethylsulfanyl)-3-methyl-1-(2-methylpropyl)-6-{[2-(trifluoromethyl)phenyl]methyl}-1H,2H,3H,4H-thieno[2,3-d]pyrimidine-2,4-dione::Thieno[2,3-d]pyrimidine-2,4(1H,3H)-dione, 10
SMILES CCSc1c(Cc2ccccc2C(F)(F)F)sc2n(CC(C)C)c(=O)n(C)c(=O)c12
InChI Key InChIKey=MIAXOMOVNFGVNO-UHFFFAOYSA-N
Data  1 KI
  Tab Delimited (TSV)   2D SDfile   Computed 3D by Vconf -m prep SDfile
Find this compound or compounds like it in BindingDB:
Activity Spreadsheet -- Enzyme Inhibition Constant Data from BindingDB
Found 1 hit for monomerid = 22003
TargetMonocarboxylate transporter 1(Homo sapiens (Human))
Astrazeneca
LigandPNGBDBM22003(5-(ethylsulfanyl)-3-methyl-1-(2-methylpropyl)-6-{[...)
Affinity DataKi:  6nM ΔG°:  -11.1kcal/molepH: 7.8 T: 2°C. Assay description: Jurkat cell membranes were incubated with [3H]-labeled ligand in the absence or presence of increasing concentrations of test compound. The reagents ...
In DepthDetails ArticlePubMed