BDBM220161 US9290476, 4
SMILES OC(c1cccnc1)(c1cccc(Cl)c1)c1ccc2nc(Cl)c(Cc3cccc(Cl)c3)c(Cl)c2c1
InChI Key InChIKey=JQYWKIHBVLDXCM-UHFFFAOYSA-N
Data  1 Kd
  Tab Delimited (TSV)   2D SDfile   Computed 3D by Vconf -m prep SDfile
Find this compound or compounds like it in BindingDB:
Activity Spreadsheet -- Enzyme Inhibition Constant Data from BindingDB
Found 1 hit for monomerid = 220161
TargetIsoform 2 of Nuclear receptor ROR-gamma (RORgT)(Homo sapiens (Human))
Janssen Pharmaceutica
US Patent
LigandPNGBDBM220161(US9290476, 4)
Affinity DataKd:  7.70nMpH: 7.0 T: 2°C. Assay description: Bar-coded assay plates are robotically loaded onto a thermostatically controlled PCR-type thermal block and then heated at a typical ramp-rate of 1 &...
Ligand InfoPC cidPC sid
In DepthDetails US Patent