BDBM220172 US9290476, 15
SMILES Cn1cncc1C(O)(c1cncs1)c1ccc2nc(Cl)c(Cc3ccc(cc3)-n3cccn3)c(Cl)c2c1
InChI Key InChIKey=YQWCFUBFHBRRQZ-UHFFFAOYSA-N
Data  1 Kd
  Tab Delimited (TSV)   2D SDfile   Computed 3D by Vconf -m prep SDfile
Find this compound or compounds like it in BindingDB:
Activity Spreadsheet -- Enzyme Inhibition Constant Data from BindingDB
Found 1 hit for monomerid = 220172
TargetIsoform 2 of Nuclear receptor ROR-gamma (RORgT)(Homo sapiens (Human))
Janssen Pharmaceutica
US Patent
LigandPNGBDBM220172(US9290476, 15)
Affinity DataKd:  4.30nMpH: 7.0 T: 2°C. Assay description: Bar-coded assay plates are robotically loaded onto a thermostatically controlled PCR-type thermal block and then heated at a typical ramp-rate of 1 &...
Ligand InfoPC cidPC sid
In DepthDetails US Patent