BDBM22024 5-{[(3R)-3-hydroxypyrrolidin-1-yl]carbonyl}-6-(isoquinolin-4-ylmethyl)-3-methyl-1-(2-methylpropyl)-1H,2H,3H,4H-thieno[2,3-d]pyrimidine-2,4-dione::Thieno[2,3-d]pyrimidine-2,4(1H,3H)-dione, 32
SMILES CC(C)Cn1c2sc(Cc3cncc4ccccc34)c(C(=O)N3CC[C@@H](O)C3)c2c(=O)n(C)c1=O
InChI Key InChIKey=CXYAINZZOIQMET-GOSISDBHSA-N
Data  1 KI
  Tab Delimited (TSV)   2D SDfile   Computed 3D by Vconf -m prep SDfile
Find this compound or compounds like it in BindingDB:
Activity Spreadsheet -- Enzyme Inhibition Constant Data from BindingDB
Found 1 hit for monomerid = 22024
TargetMonocarboxylate transporter 1(Homo sapiens (Human))
Astrazeneca
LigandPNGBDBM22024(5-{[(3R)-3-hydroxypyrrolidin-1-yl]carbonyl}-6-(iso...)
Affinity DataKi:  3.90nM ΔG°:  -11.3kcal/molepH: 7.4 T: 2°C. Assay description: A radioligand-binding assay was developed using scintillation proximity assay (SPA) technology. The wheat germ agglutinin SPA beads (Amersham) (0.2 m...
In DepthDetails ArticlePubMed