BDBM222229 4-((4-((7-Chloro-3-(hydroxyimino)-2-oxoindolin-1-yl)methyl)-1H-1,2,3-triazol-1-yl)methyl)-N-hydroxybenzamide (4g)
SMILES ONC(=O)c1ccc(Cn2cc(CN3C(=O)\C(=N/O)c4cccc(Cl)c34)nn2)cc1
InChI Key InChIKey=OHLIFQSKVCXNSS-JWGURIENSA-N
Data  1 IC50
  Tab Delimited (TSV)   2D SDfile   Computed 3D by Vconf -m prep SDfile
Find this compound or compounds like it in BindingDB:
Activity Spreadsheet -- Enzyme Inhibition Constant Data from BindingDB
Found 1 hit for monomerid = 222229
TargetHistone deacetylase 2(Homo sapiens (Human))
Hanoi University of Pharmacy
LigandPNGBDBM222229(4-((4-((7-Chloro-3-(hydroxyimino)-2-oxoindolin-1-y...)
Affinity DataIC50:  1.94E+3nM. Assay description: The HDAC enzymatic assay was performed using a Fluorogenic HDAC Assay Kit (BPS Bioscience) according to the manufacturer's instructions. Briefly,...
Ligand InfoPC cidPC sid
In DepthDetails ArticlePubMed