BDBM225261 2-Methoxy-N-(2-phenyl-1-(3-phenylpropyl)-1H-benzo[d]imidazol-5-yl)benzamide (23)
SMILES COc1ccccc1C(=O)Nc1ccc2n(CCCc3ccccc3)c(nc2c1)-c1ccccc1
InChI Key InChIKey=TYLXUWNTBABAJV-UHFFFAOYSA-N
Data  1 IC50
  Tab Delimited (TSV)   2D SDfile   Computed 3D by Vconf -m prep SDfile
Find this compound or compounds like it in BindingDB:
Activity Spreadsheet -- Enzyme Inhibition Constant Data from BindingDB
Found 1 hit for monomerid = 225261
TargetHistone-lysine N-methyltransferase EHMT2(Homo sapiens (Human))
Shenyang Pharmaceutical University
LigandPNGBDBM225261(2-Methoxy-N-(2-phenyl-1-(3-phenylpropyl)-1H-benzo[...)
Affinity DataIC50:  1.75E+3nMpH: 8.5 T: 2°C. Assay description: Biochemical activity of G9a was measured as described [Kubicek et al., Mol. Cell, 25:473-481]. Assays were performed in white, opaque 384-well plates...
Ligand InfoPC cidPC sid
In DepthDetails ArticlePubMed