BDBM22559 1-{3-[4-(5-tert-butyl-1H-1,3-benzodiazol-2-yl)-2-chlorophenoxy]propyl}-N,N-dimethylpyrrolidin-3-amine::2-arylbenzimidazole derivative, 5
SMILES CN(C)C1CCN(CCCOc2ccc(cc2Cl)-c2nc3ccc(cc3[nH]2)C(C)(C)C)C1
InChI Key InChIKey=AADBANJKFIORNE-UHFFFAOYSA-N
Data  2 KI
  Tab Delimited (TSV)   2D SDfile   Computed 3D by Vconf -m prep SDfile
Find this compound or compounds like it in BindingDB:
Activity Spreadsheet -- Enzyme Inhibition Constant Data from BindingDB
Found 2 hits for monomerid = 22559
TargetHistamine H4 receptor(Homo sapiens (Human))
Johnson & Johnson Pharmaceutical Research & Development
Curated by ChEMBL
LigandPNGBDBM22559(1-{3-[4-(5-tert-butyl-1H-1,3-benzodiazol-2-yl)-2-c...)
Affinity DataKi:  250nM. Assay description: Displacement of [3H]histamine from human recombinant histamine H4 receptor
In DepthDetails ArticlePubMed
TargetHistamine H4 receptor(Homo sapiens (Human))
Johnson & Johnson Pharmaceutical Research & Development
Curated by ChEMBL
LigandPNGBDBM22559(1-{3-[4-(5-tert-butyl-1H-1,3-benzodiazol-2-yl)-2-c...)
Affinity DataKi:  250nM ΔG°:  -9.00kcal/molepH: 7.5 T: 2°C. Assay description: The Ki values were calculated based on an experimentally determined appropriate Kd value according to Cheng and Prusoff.
In DepthDetails ArticlePubMed