BDBM228131 US9562012, 1::ethyl (2s)-2-ethoxy-3-(4-hydroxyphenyl)propanoate
SMILES CCO[C@@H](Cc1ccc(OCc2ccccn2)cc1)C(=O)NO
InChI Key InChIKey=RTJDRHVEBDAEBC-INIZCTEOSA-N
Data  1 IC50
  Tab Delimited (TSV)   2D SDfile   Computed 3D by Vconf -m prep SDfile
Find this compound or compounds like it in BindingDB:
Activity Spreadsheet -- Enzyme Inhibition Constant Data from BindingDB
Found 1 hit for monomerid = 228131
TargetNuclear receptor coactivator 2 [740-753]()
Metabolic Solutions Development
US Patent
LigandPNGBDBM228131(US9562012, 1 | ethyl (2s)-2-ethoxy-3-(4-hydroxyphe...)
Affinity DataIC50:  5.89E+4nM. Assay description: PPARγ binding is measured by a TR-FRET competitive binding assay using Invitrogen LanthaScreen TR-FRET PPARγ Competitive Binding Assay (I...
Ligand InfoPC cidPC sid
In DepthDetails US Patent