BDBM228134 US9562012, 4::ethyl (2s)-2-ethoxy-3-[4-(pyridin-2-ylmethoxy)phenyl]propanoate
SMILES CCO[C@@H](Cc1ccc(OCc2cc(CO)ccn2)cc1)C(=O)N(C)OC
InChI Key InChIKey=BELWYYNDXRZRPS-IBGZPJMESA-N
Data  1 IC50
  Tab Delimited (TSV)   2D SDfile   Computed 3D by Vconf -m prep SDfile
Find this compound or compounds like it in BindingDB:
Activity Spreadsheet -- Enzyme Inhibition Constant Data from BindingDB
Found 1 hit for monomerid = 228134
TargetNuclear receptor coactivator 2 [740-753]()
Metabolic Solutions Development
US Patent
LigandPNGBDBM228134(US9562012, 4 | ethyl (2s)-2-ethoxy-3-[4-(pyridin-2...)
Affinity DataIC50:  2.77E+4nM. Assay description: PPARγ binding is measured by a TR-FRET competitive binding assay using Invitrogen LanthaScreen TR-FRET PPARγ Competitive Binding Assay (I...
Ligand InfoPC cidPC sid
In DepthDetails US Patent