BDBM228140 (2s)-2-ethoxy-n-methoxy-3-{4-[(4-methoxypyridin-2-yl)methoxy]phenyl}propanamide hydrochloride (compound no. 5)::US9562012, 10
SMILES CCO[C@@H](Cc1ccc(OCCc2ccc(OS(C)(=O)=O)cc2)cc1)C(=O)NOC
InChI Key InChIKey=AMMVQSNUNXRUFR-FQEVSTJZSA-N
Data  1 IC50
  Tab Delimited (TSV)   2D SDfile   Computed 3D by Vconf -m prep SDfile
Find this compound or compounds like it in BindingDB:
Activity Spreadsheet -- Enzyme Inhibition Constant Data from BindingDB
Found 1 hit for monomerid = 228140
TargetNuclear receptor coactivator 2 [740-753]()
Metabolic Solutions Development
US Patent
LigandPNGBDBM228140((2s)-2-ethoxy-n-methoxy-3-{4-[(4-methoxypyridin-2-...)
Affinity DataIC50:  7.90E+3nM. Assay description: PPARγ binding is measured by a TR-FRET competitive binding assay using Invitrogen LanthaScreen TR-FRET PPARγ Competitive Binding Assay (I...
Ligand InfoPC cidPC sid
In DepthDetails US Patent