BDBM228521 US9340555, F1
SMILES COC(=O)c1cc2nccc(Oc3ccc(NC(=O)Nc4cc(C)ccc4F)cc3)c2s1
InChI Key InChIKey=SBDWNJUPCVOJLH-UHFFFAOYSA-N
Data  2 IC50
  Tab Delimited (TSV)   2D SDfile   Computed 3D by Vconf -m prep SDfile
Find this compound or compounds like it in BindingDB:
Activity Spreadsheet -- Enzyme Inhibition Constant Data from BindingDB
Found 2 hits for monomerid = 228521
TargetVascular endothelial growth factor receptor 2(Homo sapiens (Human))
Allergan
US Patent
LigandPNGBDBM228521(US9340555, F1)
Affinity DataIC50:  18nMpH: 7.2 T: 2°C. Assay description: Kinase assays were performed in 96 well microtiter plates that were coated overnight with 30 μg of poly-Glu-Tyr (4:1) in 10 mM Phosphate Buffered ...
Ligand InfoPC cidPC sid
In DepthDetails US Patent
TargetVascular endothelial growth factor receptor 2(Homo sapiens (Human))
Allergan
US Patent
LigandPNGBDBM228521(US9340555, F1)
Affinity DataIC50:  2nMT: 2°C. Assay description: Automated FLIPR (Fluorometric Imaging Plate Reader) technology was used to screen for inhibitors of VEGF induced increases in intracellular calcium l...
Ligand InfoPC cidPC sid
In DepthDetails US Patent