BDBM228565 US9340555, 58
SMILES Cc1ccc(F)c(NC(=O)Nc2ccc(Oc3ccnc4cc(sc34)C(=O)N=S(C)(C)=O)cc2F)c1
InChI Key InChIKey=WQVQUQGTLOBFOR-UHFFFAOYSA-N
Data  1 IC50
  Tab Delimited (TSV)   2D SDfile   Computed 3D by Vconf -m prep SDfile
Find this compound or compounds like it in BindingDB:
Activity Spreadsheet -- Enzyme Inhibition Constant Data from BindingDB
Found 1 hit for monomerid = 228565
TargetVascular endothelial growth factor receptor 2(Homo sapiens (Human))
Allergan
US Patent
LigandPNGBDBM228565(US9340555, 58)
Affinity DataIC50:  3nMpH: 7.2 T: 2°C. Assay description: Kinase assays were performed in 96 well microtiter plates that were coated overnight with 30 μg of poly-Glu-Tyr (4:1) in 10 mM Phosphate Buffered ...
Ligand InfoPC cidPC sid
In DepthDetails US Patent