BDBM229569 US9334279, 1045
SMILES C[C@@H]1CC\C=C/[C@@H]2C[C@]2(NC(=O)[C@@H]2C[C@H](CN2C(=O)[C@@H](NC(=O)OC(C)(C)C(F)(F)F)[C@H](C)C1)Oc1ccnc(c1)-c1nc(C)cs1)C(=O)NS(=O)(=O)C1(C)CC1
InChI Key InChIKey=HEGXGGIMAGBKOH-FPSVSVPBSA-N
Data  2 EC50
  Tab Delimited (TSV)   2D SDfile   Computed 3D by Vconf -m prep SDfile
Find this compound or compounds like it in BindingDB:
Activity Spreadsheet -- Enzyme Inhibition Constant Data from BindingDB
Found 2 hits for monomerid = 229569
TargetGenome polyprotein [1028-1200,1251-1711](Hepatitis C virus genotype 1b (strain J4L2S) (HCV))
Bristol-Myers Squibb
US Patent
LigandPNGBDBM229569(US9334279, 1045)
Affinity DataEC50:  0.300nM
Ligand InfoPC cidPC sid
In DepthDetails US Patent
TargetGenome polyprotein [1027-1711](Hepatitis C virus genotype 1a (strain H77) (HCV))
Bristol-Myers Squibb
US Patent
LigandPNGBDBM229569(US9334279, 1045)
Affinity DataEC50:  3nMT: 2°C. Assay description: HCV replicon luciferase assays were developed to monitor the inhibitory effects of compounds described in the disclosure on HCV genotypes 1a and 1b v...
Ligand InfoPC cidPC sid
In DepthDetails US Patent