BDBM229582 US9556135, 174
SMILES C[C@]1(CS(=O)(=O)[C@@](C)(F)C(N)=N1)c1cc(Nc2nccc3cc(Cl)cnc23)ccc1F
InChI Key InChIKey=PUPKLJHGAQYUEI-VQTJNVASSA-N
Data  2 IC50
  Tab Delimited (TSV)   2D SDfile   Computed 3D by Vconf -m prep SDfile
Find this compound or compounds like it in BindingDB:
Activity Spreadsheet -- Enzyme Inhibition Constant Data from BindingDB
Found 2 hits for monomerid = 229582
TargetCathepsin D(Homo sapiens (Human))
Amgen
US Patent
LigandPNGBDBM229582(US9556135, 174)
Affinity DataIC50:  1.01E+5nMpH: 3.5Assay Description:Recombinant Cat D was expressed in CHO cells. The assay buffer for CathepsinD is 0.05 M citrate pH 3.5, 10% DMSO final, 5 mM CHAPS. The Cat D enzyme ...
Ligand InfoPC cidPC sid
In DepthDetails US Patent
TargetBeta-secretase 1(Homo sapiens (Human))
Amgen
US Patent
LigandPNGBDBM229582(US9556135, 174)
Affinity DataIC50:  0.330nM. Assay description: Several animal models, including mouse, rat, dog, and monkey, may be used to screen for inhibition of beta-secretase activity in vivo following admin...
Ligand InfoPC cidPC sid
In DepthDetails US Patent