BDBM230448 US9340510, 1.052
SMILES C[C@H](NC(=O)C1CC1)c1ccc(CN2CCc3cc(OC[C@H]4CC4(F)F)ccc3C2)cc1
InChI Key InChIKey=RYXVDBCGRHLWQE-GAJHUEQPSA-N
Data  1 IC50
  Tab Delimited (TSV)   2D SDfile   Computed 3D by Vconf -m prep SDfile
Find this compound or compounds like it in BindingDB:
Activity Spreadsheet -- Enzyme Inhibition Constant Data from BindingDB
Found 1 hit for monomerid = 230448
TargetAcetyl-CoA carboxylase 2(Homo sapiens (Human))
Boehringer Ingelheim International
US Patent
LigandPNGBDBM230448(US9340510, 1.052)
Affinity DataIC50:  24nMpH: 7.5Assay Description:Assay reactions are then carried out in 384-well plates, with hACC2 in an appropriate dilution and at final assay concentrations (f.c.) of 100 mM Tri...
Ligand InfoPC cidPC sid
In DepthDetails US Patent