BDBM231298 US9346798, 45
SMILES FC(F)(F)c1ccc(N2CCOc3cc(ccc23)S(=O)(=O)Nc2ccncn2)c(c1)C1=CCNCC1
InChI Key InChIKey=FQJDSGMAKKSCMD-UHFFFAOYSA-N
Data  6 IC50
  Tab Delimited (TSV)   2D SDfile   Computed 3D by Vconf -m prep SDfile
Find this compound or compounds like it in BindingDB:
Activity Spreadsheet -- Enzyme Inhibition Constant Data from BindingDB
Found 6 hits for monomerid = 231298
TargetSodium channel protein type 5 subunit alpha(Homo sapiens (Human))
Amgen
US Patent
LigandPNGBDBM231298(US9346798, 45)
Affinity DataIC50:  1.20E+3nM. Assay description: HEK 293 cells stably transfected with either Nav 1.7 or with Nav 1.5 were recorded in population patch-clamp mode with the IonWorks® Quattro auto...
Ligand InfoPC cidPC sid
In DepthDetails US Patent
TargetSodium channel protein type 9 subunit alpha(Homo sapiens (Human))
Amgen
US Patent
LigandPNGBDBM231298(US9346798, 45)
Affinity DataIC50:  6.20nM. Assay description: HEK 293 cells stably transfected with either Nav 1.7 or with Nav 1.5 were recorded in population patch-clamp mode with the IonWorks® Quattro auto...
Ligand InfoPC cidPC sid
In DepthDetails US Patent
TargetSodium channel protein type 5 subunit alpha(Homo sapiens (Human))
Amgen
US Patent
LigandPNGBDBM231298(US9346798, 45)
Affinity DataIC50:  1.50E+3nM. Assay description: Inhibition of human NaV1.5 expressed in HEK295 cells at holding potential of -125 mV with test potentials to -10 mV by whole cell voltage clamp metho...
Ligand InfoPC cidPC sid
In DepthDetails ArticlePubMed
TargetSodium channel protein type 9 subunit alpha(Rattus norvegicus)
Amgen
Curated by ChEMBL
LigandPNGBDBM231298(US9346798, 45)
Affinity DataIC50: >3.00E+4nM. Assay description: Inhibition of rat NaV1.7 by cell based whole cell voltage clamp method
Ligand InfoPC cidPC sid
In DepthDetails ArticlePubMed
TargetSodium channel protein type 9 subunit alpha(Homo sapiens (Human))
Amgen
US Patent
LigandPNGBDBM231298(US9346798, 45)
Affinity DataIC50:  140nM. Assay description: Inhibition of human NaV1.7 expressed in HEK293 cells at holding potential of -125 mV with test potentials to -10 mV by whole cell voltage clamp metho...
Ligand InfoPC cidPC sid
In DepthDetails ArticlePubMed
TargetSodium channel protein type 9 subunit alpha(Homo sapiens (Human))
Amgen
US Patent
LigandPNGBDBM231298(US9346798, 45)
Affinity DataIC50:  135nM. Assay description: HEK 293 cells stably transfected with human Nav1.7 were recorded in whole cell voltage clamp mode with the PatchXpress automated electrophysiology sy...
Ligand InfoPC cidPC sid
In DepthDetails US Patent