BDBM231434 US9346798, 181
SMILES COc1cc(ccc1N1CCOc2cc(ccc12)S(=O)(=O)Nc1nccs1)C#N
InChI Key InChIKey=BCCZTFIOURKUIO-UHFFFAOYSA-N
Data  6 IC50
  Tab Delimited (TSV)   2D SDfile   Computed 3D by Vconf -m prep SDfile
Find this compound or compounds like it in BindingDB:
Activity Spreadsheet -- Enzyme Inhibition Constant Data from BindingDB
Found 6 hits for monomerid = 231434
TargetSodium channel protein type 5 subunit alpha(Homo sapiens (Human))
Amgen
US Patent
LigandPNGBDBM231434(US9346798, 181)
Affinity DataIC50: >1.00E+4nM. Assay description: HEK 293 cells stably transfected with either Nav 1.7 or with Nav 1.5 were recorded in population patch-clamp mode with the IonWorks® Quattro auto...
Ligand InfoPC cidPC sid
In DepthDetails US Patent
TargetSodium channel protein type 9 subunit alpha(Homo sapiens (Human))
Amgen
US Patent
LigandPNGBDBM231434(US9346798, 181)
Affinity DataIC50:  7.5nM. Assay description: HEK 293 cells stably transfected with either Nav 1.7 or with Nav 1.5 were recorded in population patch-clamp mode with the IonWorks® Quattro auto...
Ligand InfoPC cidPC sid
In DepthDetails US Patent
TargetSodium channel protein type 9 subunit alpha(Homo sapiens (Human))
Amgen
US Patent
LigandPNGBDBM231434(US9346798, 181)
Affinity DataIC50:  250nM. Assay description: Inhibition of human NaV1.7 expressed in HEK293 cells at holding potential of -125 mV with test potentials to -10 mV by whole cell voltage clamp metho...
Ligand InfoPC cidPC sid
In DepthDetails ArticlePubMed
TargetSodium channel protein type 9 subunit alpha(Rattus norvegicus)
Amgen
Curated by ChEMBL
LigandPNGBDBM231434(US9346798, 181)
Affinity DataIC50:  850nM. Assay description: Inhibition of rat NaV1.7 by cell based whole cell voltage clamp method
Ligand InfoPC cidPC sid
In DepthDetails ArticlePubMed
TargetSodium channel protein type 5 subunit alpha(Homo sapiens (Human))
Amgen
US Patent
LigandPNGBDBM231434(US9346798, 181)
Affinity DataIC50:  1.40E+4nM. Assay description: Inhibition of human NaV1.5 expressed in HEK295 cells at holding potential of -125 mV with test potentials to -10 mV by whole cell voltage clamp metho...
Ligand InfoPC cidPC sid
In DepthDetails ArticlePubMed
TargetSodium channel protein type 9 subunit alpha(Homo sapiens (Human))
Amgen
US Patent
LigandPNGBDBM231434(US9346798, 181)
Affinity DataIC50:  175nM. Assay description: HEK 293 cells stably transfected with human Nav1.7 were recorded in whole cell voltage clamp mode with the PatchXpress automated electrophysiology sy...
Ligand InfoPC cidPC sid
In DepthDetails US Patent