BDBM24107 2-ethyl-7,8-dimethyl-4-phenyl-1,2,3,4-tetrahydroisoquinoline::CHEMBL207973::tetrahydroisoquinoline (THIQ), 12
SMILES CCN1CC(c2ccccc2)c2ccc(C)c(C)c2C1
InChI Key InChIKey=KXHNOIFAYOEWOY-UHFFFAOYSA-N
Data  2 IC50
  Tab Delimited (TSV)   2D SDfile   Computed 3D by Vconf -m prep SDfile
Find this compound or compounds like it in BindingDB:
Activity Spreadsheet -- Enzyme Inhibition Constant Data from BindingDB
Found 2 hits for monomerid = 24107
TargetKinesin-like protein KIF11(Homo sapiens (Human))
China Pharmaceutical University
Curated by ChEMBL
LigandPNGBDBM24107(2-ethyl-7,8-dimethyl-4-phenyl-1,2,3,4-tetrahydrois...)
Affinity DataIC50:  2.52E+4nM. Assay description: Inhibition of KSP
In DepthDetails ArticlePubMed
TargetKinesin-like protein KIF11(Homo sapiens (Human))
China Pharmaceutical University
Curated by ChEMBL
LigandPNGBDBM24107(2-ethyl-7,8-dimethyl-4-phenyl-1,2,3,4-tetrahydrois...)
Affinity DataIC50:  2.52E+4nMpH: 7.0 T: 2°C. Assay description: ATPase assays with Eg5 motor domain protein were performed using Kinase-Glo Luminescent Kit as described by the manufacturer (Promega).
In DepthDetails ArticlePubMed