BDBM24109 7,8-dimethyl-4-phenyl-2-(2-phenylethyl)-1,2,3,4-tetrahydroisoquinoline::tetrahydroisoquinoline (THIQ), 14
SMILES Cc1ccc2C(CN(CCc3ccccc3)Cc2c1C)c1ccccc1
InChI Key InChIKey=AQIANVVPEXKNAN-UHFFFAOYSA-N
Data  1 IC50
  Tab Delimited (TSV)   2D SDfile   Computed 3D by Vconf -m prep SDfile
Find this compound or compounds like it in BindingDB:
Activity Spreadsheet -- Enzyme Inhibition Constant Data from BindingDB
Found 1 hit for monomerid = 24109
TargetKinesin-like protein KIF11(Homo sapiens (Human))
Bristol-Myers Squibb
LigandPNGBDBM24109(7,8-dimethyl-4-phenyl-2-(2-phenylethyl)-1,2,3,4-te...)
Affinity DataIC50: >2.50E+4nMpH: 7.0 T: 2°C. Assay description: ATPase assays with Eg5 motor domain protein were performed using Kinase-Glo Luminescent Kit as described by the manufacturer (Promega).
In DepthDetails ArticlePubMed