BDBM241112 US9409895, 23::US9630945, 23
SMILES Oc1cc(CCC(=O)NC2CCN(CC2)C(=O)OCc2cc(Cl)cc(Cl)c2)on1
InChI Key InChIKey=CJQTVHPJCIVSKK-UHFFFAOYSA-N
Data  2 IC50
  Tab Delimited (TSV)   2D SDfile   Computed 3D by Vconf -m prep SDfile
Find this compound or compounds like it in BindingDB:
Activity Spreadsheet -- Enzyme Inhibition Constant Data from BindingDB
Found 2 hits for monomerid = 241112
TargetAtaxin-2(Homo sapiens (Human))
Novartis
US Patent
LigandPNGBDBM241112(US9409895, 23 | US9630945, 23)
Affinity DataIC50:  396nM. Assay description: ATX activity was determined by measurement of released choline in reactions containing ATX (10 nM), choline oxidase (0.1 U/ml), HRP (100 U/ml), ample...
Ligand InfoPC cidPC sid
In DepthDetails US Patent
TargetEctonucleotide pyrophosphatase/phosphodiesterase family member 2(Homo sapiens (Human))
Novartis
US Patent
LigandPNGBDBM241112(US9409895, 23 | US9630945, 23)
Affinity DataIC50:  396nM. Assay description: ATX activity was determined by measurement of released choline in reactions containing ATX (10 nM), choline oxidase (0.1 U/ml), HRP (100 U/ml), ample...
Ligand InfoPC cidPC sid
In DepthDetails US Patent