BDBM241119 US9409895, 30::US9630945, 30
SMILES CN(CCC1CCN(CC1)C(=O)\C=C\c1cc(Cl)cc(Cl)c1)C(=O)c1c[nH]c(=O)o1
InChI Key InChIKey=OFSRYARVYACYMI-NSCUHMNNSA-N
Data  2 IC50
  Tab Delimited (TSV)   2D SDfile   Computed 3D by Vconf -m prep SDfile
Find this compound or compounds like it in BindingDB:
Activity Spreadsheet -- Enzyme Inhibition Constant Data from BindingDB
Found 2 hits for monomerid = 241119
TargetAtaxin-2(Homo sapiens (Human))
Novartis
US Patent
LigandPNGBDBM241119(US9409895, 30 | US9630945, 30)
Affinity DataIC50:  274nM. Assay description: ATX activity was determined by measurement of released choline in reactions containing ATX (10 nM), choline oxidase (0.1 U/ml), HRP (100 U/ml), ample...
Ligand InfoPC cidPC sid
In DepthDetails US Patent
TargetEctonucleotide pyrophosphatase/phosphodiesterase family member 2(Homo sapiens (Human))
Novartis
US Patent
LigandPNGBDBM241119(US9409895, 30 | US9630945, 30)
Affinity DataIC50:  274nM. Assay description: ATX activity was determined by measurement of released choline in reactions containing ATX (10 nM), choline oxidase (0.1 U/ml), HRP (100 U/ml), ample...
Ligand InfoPC cidPC sid
In DepthDetails US Patent