BDBM241144 US9409895, 54::US9630945, 54
SMILES FC(F)(F)c1ccc(CCC(=O)N2CCC(CC2)NC(=O)CCCc2c[nH]nn2)cc1
InChI Key InChIKey=OCAAWWILIVEGFI-UHFFFAOYSA-N
Data  2 IC50
  Tab Delimited (TSV)   2D SDfile   Computed 3D by Vconf -m prep SDfile
Find this compound or compounds like it in BindingDB:
Activity Spreadsheet -- Enzyme Inhibition Constant Data from BindingDB
Found 2 hits for monomerid = 241144
TargetAtaxin-2(Homo sapiens (Human))
Novartis
US Patent
LigandPNGBDBM241144(US9409895, 54 | US9630945, 54)
Affinity DataIC50:  87nM. Assay description: ATX activity was determined by measurement of released choline in reactions containing ATX (10 nM), choline oxidase (0.1 U/ml), HRP (100 U/ml), ample...
Ligand InfoPC cidPC sid
In DepthDetails US Patent
TargetEctonucleotide pyrophosphatase/phosphodiesterase family member 2(Homo sapiens (Human))
Novartis
US Patent
LigandPNGBDBM241144(US9409895, 54 | US9630945, 54)
Affinity DataIC50:  87nM. Assay description: ATX activity was determined by measurement of released choline in reactions containing ATX (10 nM), choline oxidase (0.1 U/ml), HRP (100 U/ml), ample...
Ligand InfoPC cidPC sid
In DepthDetails US Patent