BDBM24119 methyl 7,8-dimethyl-4-phenyl-1,2,3,4-tetrahydroisoquinoline-2-carboxylate::tetrahydroisoquinoline (THIQ), 24
SMILES COC(=O)N1CC(c2ccccc2)c2ccc(C)c(C)c2C1
InChI Key InChIKey=PEXJZWKMZUIUFY-UHFFFAOYSA-N
Data  1 IC50
  Tab Delimited (TSV)   2D SDfile   Computed 3D by Vconf -m prep SDfile
Find this compound or compounds like it in BindingDB:
Activity Spreadsheet -- Enzyme Inhibition Constant Data from BindingDB
Found 1 hit for monomerid = 24119
TargetKinesin-like protein KIF11(Homo sapiens (Human))
Bristol-Myers Squibb
LigandPNGBDBM24119(methyl 7,8-dimethyl-4-phenyl-1,2,3,4-tetrahydroiso...)
Affinity DataIC50:  1.44E+4nMpH: 7.0 T: 2°C. Assay description: ATPase assays with Eg5 motor domain protein were performed using Kinase-Glo Luminescent Kit as described by the manufacturer (Promega).
In DepthDetails ArticlePubMed