BDBM24140 8-chloro-4-(3-hydroxyphenyl)-N,N-dimethyl-1,2,3,4-tetrahydroisoquinoline-2-carboxamide::tetrahydroisoquinoline (THIQ), 44
SMILES CN(C)C(=O)N1CC(c2cccc(O)c2)c2cccc(Cl)c2C1
InChI Key InChIKey=YBWJTCYDMKKHRF-UHFFFAOYSA-N
Data  1 IC50
  Tab Delimited (TSV)   2D SDfile   Computed 3D by Vconf -m prep SDfile
Find this compound or compounds like it in BindingDB:
Activity Spreadsheet -- Enzyme Inhibition Constant Data from BindingDB
Found 1 hit for monomerid = 24140
TargetKinesin-like protein KIF11(Homo sapiens (Human))
Bristol-Myers Squibb
LigandPNGBDBM24140(8-chloro-4-(3-hydroxyphenyl)-N,N-dimethyl-1,2,3,4-...)
Affinity DataIC50: >2.50E+4nM. Assay description: ATPase assays with Eg5 motor domain protein were performed using Kinase-Glo Luminescent Kit as described by the manufacturer (Promega).
In DepthDetails ArticlePubMed