BDBM243052 PTP inhibitor, 4d
SMILES Oc1cc(O)c2C(=O)CC(Oc2c1)c1ccccc1Cl
InChI Key InChIKey=PNVHHMNUNVWWMR-UHFFFAOYSA-N
Data  1 IC50
  Tab Delimited (TSV)   2D SDfile   Computed 3D by Vconf -m prep SDfile
Find this compound or compounds like it in BindingDB:
Activity Spreadsheet -- Enzyme Inhibition Constant Data from BindingDB
Found 1 hit for monomerid = 243052
TargetTyrosine-protein phosphatase non-receptor type 1(Homo sapiens (Human))
Yanbian University College of Pharmacy
LigandPNGBDBM243052(PTP inhibitor, 4d)
Affinity DataIC50:  1.02E+4nMpH: 6.5 T: 2°C. Assay description: Briefly, the enzymatic activity of the PTP1B catalytic domain was determinedat 30°C by monitoring the hydrolysis of pNPP. Dephosphorylation of pNPP g...
Ligand InfoPC cidPC sid
In DepthDetails ArticlePubMed