BDBM243395 5-chloro-N4-2-(isopropylsulfonyl)phenyl)-N2-(7-methoxy-1-ethyl-1,2,3,4-tetrahydroisoquinolin-6-yl)pyrimidine-2,4-diamine::US10053458, 27
SMILES CCC1NCCc2cc(Nc3ncc(Cl)c(Nc4ccccc4S(=O)(=O)C(C)C)n3)c(OC)cc12
InChI Key InChIKey=KRUXWJYHRHHEMW-UHFFFAOYSA-N
Data  2 IC50
  Tab Delimited (TSV)   2D SDfile   Computed 3D by Vconf -m prep SDfile
Find this compound or compounds like it in BindingDB:
Activity Spreadsheet -- Enzyme Inhibition Constant Data from BindingDB
Found 2 hits for monomerid = 243395
TargetALK tyrosine kinase receptor [L1196M](Homo sapiens (Human))
Korea Research Institute of Chemical Technology
US Patent
LigandPNGBDBM243395(5-chloro-N4-2-(isopropylsulfonyl)phenyl)-N2-(7-met...)
Affinity DataIC50:  3.40nM
Ligand InfoPC cidPC sid
In DepthDetails US Patent
TargetALK tyrosine kinase receptor(Homo sapiens (Human))
Korea Research Institute of Chemical Technology
US Patent
LigandPNGBDBM243395(5-chloro-N4-2-(isopropylsulfonyl)phenyl)-N2-(7-met...)
Affinity DataIC50:  0.300nMT: 2°C. Assay description: A proliferation inhibitory activity against the ALK of the compound represented by Chemical Formula 1 according to the present invention at an enzyme...
Ligand InfoPC cidPC sid
In DepthDetails US Patent