BDBM244752 US10226449, cpd 362::US9428502, 362
SMILES COCCc1nc(c([nH]1)-c1cc(ccc1C)C(=O)N1CC(C1)c1ccc(cc1)C#N)C(F)(F)F
InChI Key InChIKey=FWVVSTOCMYAPPJ-UHFFFAOYSA-N
Data  2 IC50
  Tab Delimited (TSV)   2D SDfile   Computed 3D by Vconf -m prep SDfile
Find this compound or compounds like it in BindingDB:
Activity Spreadsheet -- Enzyme Inhibition Constant Data from BindingDB
Found 2 hits for monomerid = 244752
TargetFatty acid synthase(Homo sapiens (Human))
3-V Biosciences
US Patent
LigandPNGBDBM244752(US10226449, cpd 362 | US9428502, 362)
Affinity DataIC50:  11nM. Assay description: FASN activity of the SKBr3 cell extract was determined by measuring either NADPH oxidation or the amount of thiol-containing coenzyme A (CoA) release...
Ligand InfoPC cidPC sid
In DepthDetails US Patent
TargetFatty acid synthase(Homo sapiens (Human))
3-V Biosciences
US Patent
LigandPNGBDBM244752(US10226449, cpd 362 | US9428502, 362)
Affinity DataIC50:  11nMT: 2°C. Assay description: The FASN enzyme was isolated from SKBr3 cells. SKBr3 is a human breast cancer cell-line with high levels of FASN expression. It is estimated that FAS...
Ligand InfoPC cidPC sid
In DepthDetails US Patent