BDBM245479 US9428503, 6
SMILES CO[C@H]1C[C@H](C1)n1c2c(cnc3cc(F)c(cc23)-c2ccc(OCCCN(C)C)nc2)n(C)c1=O
InChI Key InChIKey=ZOFXOZXMDBPIQF-HDICACEKSA-N
Data  7 IC50
  Tab Delimited (TSV)   2D SDfile   Computed 3D by Vconf -m prep SDfile
Find this compound or compounds like it in BindingDB:
Activity Spreadsheet -- Enzyme Inhibition Constant Data from BindingDB
Found 7 hits for monomerid = 245479
TargetSerine-protein kinase ATM(Homo sapiens (Human))
Astrazeneca
US Patent
LigandPNGBDBM245479(US9428503, 6)
Affinity DataIC50:  1.05nMT: 2°C. Assay description: Assay a) HT29 cells (ECACC #85061109) were seeded into 384 well assay plates (Costar #3712) at a density of 3500 cells/well in 40 μl EMEM medium c...
Ligand InfoPC cidPC sid
In DepthDetails US Patent
TargetSerine/threonine-protein kinase ATR(Homo sapiens (Human))
Astrazeneca
US Patent
LigandPNGBDBM245479(US9428503, 6)
Affinity DataIC50: >3.00E+4nMT: 2°C. Assay description: Assay b) HT29 cells (ECACC #85061109) were seeded into 384 well assay plates (Costar #3712) at a density of 6000 cells/well in 40 μl EMEM medium c...
Ligand InfoPC cidPC sid
In DepthDetails US Patent
LigandPNGBDBM245479(US9428503, 6)
Affinity DataIC50: >3.00E+4nMT: 2°C. Assay description: Assay c) BT474 cells (human breast ductal carcinoma, ATCC HTB-20) were seeded into black 384 well plates (Costar, #3712) at a density of 5600 cells/w...
Ligand InfoPC cidPC sid
In DepthDetails US Patent
TargetPotassium voltage-gated channel subfamily H member 2(Homo sapiens (Human))
Astrazeneca
Curated by ChEMBL
LigandPNGBDBM245479(US9428503, 6)
Affinity DataIC50: >3.30E+4nM. Assay description: Inhibition of human ERG by electrophysiology assay
Ligand InfoPC cidPC sid
In DepthDetails ArticlePubMed
TargetSerine/threonine-protein kinase ATR(Homo sapiens (Human))
Astrazeneca
US Patent
LigandPNGBDBM245479(US9428503, 6)
Affinity DataIC50: >3.00E+4nM. Assay description: Inhibition of ATR in human HT29 cells assessed as decrease in Chk1 phosphorylation at Ser 345 preincubated for 1 hr followed by 4NQO addition and mea...
Ligand InfoPC cidPC sid
In DepthDetails ArticlePubMed
TargetSerine-protein kinase ATM(Homo sapiens (Human))
Astrazeneca
US Patent
LigandPNGBDBM245479(US9428503, 6)
Affinity DataIC50:  1.10nM. Assay description: Inhibition of ATM autophosphorylation at Ser1981 in human HT29 cells preincubated for 1 hr followed by X ray irradiation and measured after 1 hr by H...
Ligand InfoPC cidPC sid
In DepthDetails ArticlePubMed
TargetSerine/threonine-protein kinase mTOR(Homo sapiens (Human))
Astrazeneca
US Patent
LigandPNGBDBM245479(US9428503, 6)
Affinity DataIC50: >1.69E+4nMT: 2°C. Assay description: Assay d) MDA-MB-468 cells (human breast adenocarcinoma ##ATCC HTB 132) were seeded at 1500 cells/well in 40 μl of DMEM containing 10% FBS and 1% g...
Ligand InfoPC cidPC sid
In DepthDetails US Patent