BDBM245527 US9428503, 55
SMILES Cn1c2cnc3ccc(cc3c2n([C@H]2CCOC2)c1=O)-c1ccc(OCCCN2CCCCC2)nc1
InChI Key InChIKey=DAFNHYUSSJGHDH-QFIPXVFZSA-N
Data  4 IC50
  Tab Delimited (TSV)   2D SDfile   Computed 3D by Vconf -m prep SDfile
Find this compound or compounds like it in BindingDB:
Activity Spreadsheet -- Enzyme Inhibition Constant Data from BindingDB
Found 4 hits for monomerid = 245527
TargetSerine-protein kinase ATM(Homo sapiens (Human))
Astrazeneca
US Patent
LigandPNGBDBM245527(US9428503, 55)
Affinity DataIC50:  0.493nMT: 2°C. Assay description: Assay a) HT29 cells (ECACC #85061109) were seeded into 384 well assay plates (Costar #3712) at a density of 3500 cells/well in 40 μl EMEM medium c...
Ligand InfoPC cidPC sid
In DepthDetails US Patent
TargetSerine/threonine-protein kinase mTOR(Homo sapiens (Human))
Astrazeneca
US Patent
LigandPNGBDBM245527(US9428503, 55)
Affinity DataIC50:  3.38E+3nMT: 2°C. Assay description: Assay d) MDA-MB-468 cells (human breast adenocarcinoma ##ATCC HTB 132) were seeded at 1500 cells/well in 40 μl of DMEM containing 10% FBS and 1% g...
Ligand InfoPC cidPC sid
In DepthDetails US Patent
LigandPNGBDBM245527(US9428503, 55)
Affinity DataIC50: >9.13E+3nMT: 2°C. Assay description: Assay c) BT474 cells (human breast ductal carcinoma, ATCC HTB-20) were seeded into black 384 well plates (Costar, #3712) at a density of 5600 cells/w...
Ligand InfoPC cidPC sid
In DepthDetails US Patent
TargetSerine/threonine-protein kinase ATR(Homo sapiens (Human))
Astrazeneca
US Patent
LigandPNGBDBM245527(US9428503, 55)
Affinity DataIC50: >1.61E+4nMT: 2°C. Assay description: Assay b) HT29 cells (ECACC #85061109) were seeded into 384 well assay plates (Costar #3712) at a density of 6000 cells/well in 40 μl EMEM medium c...
Ligand InfoPC cidPC sid
In DepthDetails US Patent