BDBM247015 US9701638, 6
SMILES Oc1cc2cccc(Br)c2[nH]c1=O
InChI Key InChIKey=XRNDYDYDWWZFHR-UHFFFAOYSA-N
Data  1 IC50
  Tab Delimited (TSV)   2D SDfile   Computed 3D by Vconf -m prep SDfile
Find this compound or compounds like it in BindingDB:
Activity Spreadsheet -- Enzyme Inhibition Constant Data from BindingDB
Found 1 hit for monomerid = 247015
TargetHemagglutinin(Influenza A virus (strain swl A/California/04/2009...)
Rutgers, The State University of New Jersey
US Patent
LigandPNGBDBM247015(US9701638, 6)
Affinity DataIC50:  1.06E+4nMpH: 7.5Assay Description:The PAN domain has been shown to cleave ssRNA as well as ssDNA. To demonstrate the inhibition of endonuclease cleavage by PAN, a high throughput assa...
In DepthDetails US Patent