BDBM247016 US9701638, 7
SMILES Oc1c(-c2ccc(F)cc2)c2ccccc2[nH]c1=O
InChI Key InChIKey=HWLFFZSGMUOCNF-UHFFFAOYSA-N
Data  1 IC50
  Tab Delimited (TSV)   2D SDfile   Computed 3D by Vconf -m prep SDfile
Find this compound or compounds like it in BindingDB:
Activity Spreadsheet -- Enzyme Inhibition Constant Data from BindingDB
Found 1 hit for monomerid = 247016
TargetHemagglutinin(Influenza A virus (strain swl A/California/04/2009...)
Rutgers, The State University of New Jersey
US Patent
LigandPNGBDBM247016(US9701638, 7)
Affinity DataIC50:  1.08E+4nMpH: 7.5Assay Description:The PAN domain has been shown to cleave ssRNA as well as ssDNA. To demonstrate the inhibition of endonuclease cleavage by PAN, a high throughput assa...
Ligand InfoPC cidPC sid
In DepthDetails US Patent