BDBM248104 IMPDH II inhibitor, 21
SMILES CCC(CC#N)OC(=O)N[C@@H](C)c1cccc(NC(=O)Nc2ccc3n(C)cnc3c2)c1
InChI Key InChIKey=VVCQWTRTXWXYJT-FUKCDUGKSA-N
Data  1 IC50
  Tab Delimited (TSV)   2D SDfile   Computed 3D by Vconf -m prep SDfile
Find this compound or compounds like it in BindingDB:
Activity Spreadsheet -- Enzyme Inhibition Constant Data from BindingDB
Found 1 hit for monomerid = 248104
TargetInosine-5'-monophosphate dehydrogenase 2(Homo sapiens (Human))
Nycomed
LigandPNGBDBM248104(IMPDH II inhibitor, 21)
Affinity DataIC50:  1.40E+4nMpH: 8.0 T: 2°C. Assay description: The assay was performed in a 100 μL final volume in 96-well UV plates (Costar, 3635) with a reaction buffer composed of 50 mM Tris-HCl (pH 8.0), 1...
Ligand InfoPC cidPC sid
In DepthDetails ArticlePubMed