BDBM248126 IMPDH II inhibitor, 45
SMILES COc1cc(N\C(Nc2cccc(OCC(=O)C(C)=O)c2)=N\C#N)ccc1C#N
InChI Key InChIKey=JOGBVRKFEPCQLE-UHFFFAOYSA-N
Data  1 IC50
  Tab Delimited (TSV)   2D SDfile   Computed 3D by Vconf -m prep SDfile
Find this compound or compounds like it in BindingDB:
Activity Spreadsheet -- Enzyme Inhibition Constant Data from BindingDB
Found 1 hit for monomerid = 248126
TargetInosine-5'-monophosphate dehydrogenase 2(Homo sapiens (Human))
Nycomed
LigandPNGBDBM248126(IMPDH II inhibitor, 45)
Affinity DataIC50: <3.00E+4nMpH: 8.0 T: 2°C. Assay description: The assay was performed in a 100 μL final volume in 96-well UV plates (Costar, 3635) with a reaction buffer composed of 50 mM Tris-HCl (pH 8.0), 1...
Ligand InfoPC cidPC sid
In DepthDetails ArticlePubMed