BDBM249308 US10017501, Compound 1020-113::US9458145, 1020-113
SMILES Cc1noc(C)c1-c1cc(c2nc([nH]c2c1)C1CC1)C(O)(c1ccccc1)c1ccccn1
InChI Key
Data  2 KI  2 IC50
  Tab Delimited (TSV)   2D SDfile   Computed 3D by Vconf -m prep SDfile
Find this compound or compounds like it in BindingDB:
Activity Spreadsheet -- Enzyme Inhibition Constant Data from BindingDB
Found 4 hits for monomerid = 249308
TargetBromodomain-containing protein 4 [75-147](Homo sapiens (Human))
Gilead Sciences
US Patent
LigandPNGBDBM249308(US10017501, Compound 1020-113 | US9458145, 1020-11...)
Affinity DataKi:  10.7nM. Assay description: Binding of the two tandem bromodomains, BRD4-1 and BRD4-2, to an acetylated histone H4 peptide was measured using a homogeneous time resolved fluores...
Ligand InfoPC cidPC sid
In DepthDetails US Patent
TargetBromodomain-containing protein 4 [368-440](Homo sapiens (Human))
Gilead Sciences
US Patent
LigandPNGBDBM249308(US10017501, Compound 1020-113 | US9458145, 1020-11...)
Affinity DataKi:  12.8nM. Assay description: Binding of the two tandem bromodomains, BRD4-1 and BRD4-2, to an acetylated histone H4 peptide was measured using a homogeneous time resolved fluores...
Ligand InfoPC cidPC sid
In DepthDetails US Patent
TargetBromodomain-containing protein 4 [75-147](Homo sapiens (Human))
Gilead Sciences
US Patent
LigandPNGBDBM249308(US10017501, Compound 1020-113 | US9458145, 1020-11...)
Affinity DataIC50:  10.7nMpH: 7.5 T: 2°C. Assay description: The labeled ligand specifically binds BRD4-1 and BRD4-2 and can be displaced by a small molecule inhibitor that shares a similar or overlapping bindi...
Ligand InfoPC cidPC sid
In DepthDetails US Patent
TargetBromodomain-containing protein 4 [368-440](Homo sapiens (Human))
Gilead Sciences
US Patent
LigandPNGBDBM249308(US10017501, Compound 1020-113 | US9458145, 1020-11...)
Affinity DataIC50:  12.8nMpH: 7.5 T: 2°C. Assay description: The labeled ligand specifically binds BRD4-1 and BRD4-2 and can be displaced by a small molecule inhibitor that shares a similar or overlapping bindi...
Ligand InfoPC cidPC sid
In DepthDetails US Patent