BDBM25085 3-[7-amino-3-(3-hydroxyphenyl)quinoxalin-2-yl]phenol::quinoxaline derivative, 8
SMILES Nc1ccc2nc(-c3cccc(O)c3)c(nc2c1)-c1cccc(O)c1
InChI Key InChIKey=ABRXGDFENWZLCW-UHFFFAOYSA-N
Data  1 IC50
  Tab Delimited (TSV)   2D SDfile   Computed 3D by Vconf -m prep SDfile
Find this compound or compounds like it in BindingDB:
Activity Spreadsheet -- Enzyme Inhibition Constant Data from BindingDB
Found 1 hit for monomerid = 25085
LigandPNGBDBM25085(3-[7-amino-3-(3-hydroxyphenyl)quinoxalin-2-yl]phen...)
Affinity DataIC50:  1.70E+4nMpH: 7.4 T: 2°C. Assay description: The luminescence-based kinase assay with recombinant phosphatidylinositol 3-kinase (Upstate Cell Signaling Solutions) was used for the determination ...
In DepthDetails ArticlePubMed