BDBM25086 3,3 -Pteridine-6,7-diyldiphenol::3-[7-(3-hydroxyphenyl)pteridin-6-yl]phenol::Pteridine derivative, 9
SMILES Oc1cccc(c1)-c1nc2cncnc2nc1-c1cccc(O)c1
InChI Key InChIKey=CCAGYSMBBCSYDP-UHFFFAOYSA-N
Data  1 IC50
  Tab Delimited (TSV)   2D SDfile   Computed 3D by Vconf -m prep SDfile
Find this compound or compounds like it in BindingDB:
Activity Spreadsheet -- Enzyme Inhibition Constant Data from BindingDB
Found 1 hit for monomerid = 25086
LigandPNGBDBM25086(3,3 -Pteridine-6,7-diyldiphenol | 3-[7-(3-hydroxyp...)
Affinity DataIC50:  9.00E+3nMpH: 7.4 T: 2°C. Assay description: The luminescence-based kinase assay with recombinant phosphatidylinositol 3-kinase (Upstate Cell Signaling Solutions) was used for the determination ...
In DepthDetails ArticlePubMed