BDBM25100 4-(2,4-diaminopteridin-7-yl)benzene-1,2-diol::diaminopteridine derivative, 23
SMILES Nc1nc(N)c2ncc(nc2n1)-c1ccc(O)c(O)c1
InChI Key InChIKey=USBFGEGDJQLDEG-UHFFFAOYSA-N
Data  1 IC50
  Tab Delimited (TSV)   2D SDfile   Computed 3D by Vconf -m prep SDfile
Find this compound or compounds like it in BindingDB:
Activity Spreadsheet -- Enzyme Inhibition Constant Data from BindingDB
Found 1 hit for monomerid = 25100
LigandPNGBDBM25100(4-(2,4-diaminopteridin-7-yl)benzene-1,2-diol | dia...)
Affinity DataIC50:  5.90E+3nMpH: 7.4 T: 2°C. Assay description: The luminescence-based kinase assay with recombinant phosphatidylinositol 3-kinase (Upstate Cell Signaling Solutions) was used for the determination ...
In DepthDetails ArticlePubMed