BDBM25103 3-(3-{2,4-diamino-6-[3-(2,3-dihydroxypropoxy)phenyl]pteridin-7-yl}phenoxy)propane-1,2-diol::diaminopteridine derivative, 26
SMILES Nc1nc(N)c2nc(-c3cccc(OCC(O)CO)c3)c(nc2n1)-c1cccc(OCC(O)CO)c1
InChI Key InChIKey=YSCIYDATXPXTPF-UHFFFAOYSA-N
Data  1 IC50
  Tab Delimited (TSV)   2D SDfile   Computed 3D by Vconf -m prep SDfile
Find this compound or compounds like it in BindingDB:
Activity Spreadsheet -- Enzyme Inhibition Constant Data from BindingDB
Found 1 hit for monomerid = 25103
LigandPNGBDBM25103(3-(3-{2,4-diamino-6-[3-(2,3-dihydroxypropoxy)pheny...)
Affinity DataIC50:  3.27E+4nMpH: 7.4 T: 2°C. Assay description: The luminescence-based kinase assay with recombinant phosphatidylinositol 3-kinase (Upstate Cell Signaling Solutions) was used for the determination ...
In DepthDetails ArticlePubMed