BDBM25110 4-[4-amino-6-(4-hydroxyphenyl)pteridin-7-yl]phenol::aminopteridine derivative, 5
SMILES Nc1ncnc2nc(-c3ccc(O)cc3)c(nc12)-c1ccc(O)cc1
InChI Key InChIKey=KVNYNGRTGRITSD-UHFFFAOYSA-N
Data  1 IC50
  Tab Delimited (TSV)   2D SDfile   Computed 3D by Vconf -m prep SDfile
Find this compound or compounds like it in BindingDB:
Activity Spreadsheet -- Enzyme Inhibition Constant Data from BindingDB
Found 1 hit for monomerid = 25110
LigandPNGBDBM25110(4-[4-amino-6-(4-hydroxyphenyl)pteridin-7-yl]phenol...)
Affinity DataIC50:  4.00E+3nM. Assay description: The luminescence-based kinase assay with recombinant phosphatidylinositol 3-kinase (Upstate Cell Signaling Solutions) was used for the determination ...
In DepthDetails ArticlePubMed