BDBM25370 (R)-(hydroxyethylamino)sulfonamide isostere, 3g::US8501961, 21::US8501961, 3g::cycloheptyl N-[(2S,3R)-3-hydroxy-4-[(4-methoxybenzene)(2-methylpropyl)sulfonamido]-1-phenylbutan-2-yl]carbamate
SMILES COc1ccc(cc1)S(=O)(=O)N(CC(C)C)C[C@@H](O)[C@H](Cc1ccccc1)NC(=O)OC1CCCCCC1
InChI Key InChIKey=IZHOPUUPGTUJKC-WUFINQPMSA-N
Data  2 KI
  Tab Delimited (TSV)   2D SDfile   Computed 3D by Vconf -m prep SDfile
Find this compound or compounds like it in BindingDB:
Activity Spreadsheet -- Enzyme Inhibition Constant Data from BindingDB
Found 2 hits for monomerid = 25370
TargetGag-Pol polyprotein(Human immunodeficiency virus type 1 group M subtyp...)
Purdue Research Foundation
US Patent
LigandPNGBDBM25370((R)-(hydroxyethylamino)sulfonamide isostere, 3g | ...)
Affinity DataKi:  27nM. Assay description: Enzyme inhibitory assay utilizes a protocol described by Toth and Marshall (Toth, M. V.; Marshall G.R. A simple, continuous fluormetric assay for HIV...
In DepthDetails US Patent
TargetDimer of Gag-Pol polyprotein [501-599,Q508K,L534I,L564I,C568A,C596A](Human immunodeficiency virus type 1)
Purdue University
LigandPNGBDBM25370((R)-(hydroxyethylamino)sulfonamide isostere, 3g | ...)
Affinity DataKi:  27nM ΔG°:  -10.3kcal/molepH: 6.4 T: 2°C. Assay description: The Ki values were determined by substrate cleavage assay using fluorogenic substrate, 2-(aminobenzoyl)-Thr-Ile-Nle-Phe(p-NO2)-Gln-Arg-NH2. A standar...
In DepthDetails ArticlePubMed