BDBM25383 7-benzyl-3-methyl-8-[(2Z)-2-[1-(4-nitrophenyl)ethylidene]hydrazin-1-yl]-2,3,6,7-tetrahydro-1H-purine-2,6-dione::purine-2,6-dione, 26
SMILES CC(N=Nc1nc2n(C)c(=O)[nH]c(=O)c2n1Cc1ccccc1)c1ccc(cc1)[N+]([O-])=O
InChI Key InChIKey=YUBXYZWSOMHUSV-UHFFFAOYSA-N
Data  1 IC50
  Tab Delimited (TSV)   2D SDfile   Computed 3D by Vconf -m prep SDfile
Find this compound or compounds like it in BindingDB:
Activity Spreadsheet -- Enzyme Inhibition Constant Data from BindingDB
Found 1 hit for monomerid = 25383
TargetSerine/threonine-protein kinase B-raf(Homo sapiens (Human))
University of Pennsylvania
LigandPNGBDBM25383(7-benzyl-3-methyl-8-[(2Z)-2-[1-(4-nitrophenyl)ethy...)
Affinity DataIC50:  4.60E+3nMpH: 7.0 T: 2°C. Assay description: BRAF kinase activity was quantified using an ELISA-based MEK phosphorylation assay. IC50 values were derived from the sigmoidal dose-response curve f...
In DepthDetails ArticlePubMed