BDBM25385 8-{[(2E)-3-chlorobut-2-en-1-yl]sulfanyl}-7-(2-hydroxy-4-phenylbutyl)-3-methyl-2,3,6,7-tetrahydro-1H-purine-2,6-dione::purine-2,6-dione, 28
SMILES C\C(Cl)=C/CSc1nc2n(C)c(=O)[nH]c(=O)c2n1CC(O)CCc1ccccc1
InChI Key InChIKey=SCRFATXHLQNDDY-JLHYYAGUSA-N
Data  1 IC50
  Tab Delimited (TSV)   2D SDfile   Computed 3D by Vconf -m prep SDfile
Find this compound or compounds like it in BindingDB:
Activity Spreadsheet -- Enzyme Inhibition Constant Data from BindingDB
Found 1 hit for monomerid = 25385
TargetSerine/threonine-protein kinase B-raf(Homo sapiens (Human))
University of Pennsylvania
LigandPNGBDBM25385(8-{[(2E)-3-chlorobut-2-en-1-yl]sulfanyl}-7-(2-hydr...)
Affinity DataIC50:  3.75E+3nMpH: 7.0 T: 2°C. Assay description: BRAF kinase activity was quantified using an ELISA-based MEK phosphorylation assay. IC50 values were derived from the sigmoidal dose-response curve f...
Ligand InfoPC cidPC sid
In DepthDetails ArticlePubMed