BDBM25386 3-methyl-8-[(2Z)-2-[(3-nitrophenyl)methylidene]hydrazin-1-yl]-7-(prop-2-en-1-yl)-2,3,6,7-tetrahydro-1H-purine-2,6-dione::purine-2,6-dione, 29
SMILES Cn1c2nc(N=NCc3cccc(c3)[N+]([O-])=O)n(CC=C)c2c(=O)[nH]c1=O
InChI Key InChIKey=OSOLAGBLMDUURC-UHFFFAOYSA-N
Data  1 IC50
  Tab Delimited (TSV)   2D SDfile   Computed 3D by Vconf -m prep SDfile
Find this compound or compounds like it in BindingDB:
Activity Spreadsheet -- Enzyme Inhibition Constant Data from BindingDB
Found 1 hit for monomerid = 25386
TargetSerine/threonine-protein kinase B-raf(Homo sapiens (Human))
University of Pennsylvania
LigandPNGBDBM25386(3-methyl-8-[(2Z)-2-[(3-nitrophenyl)methylidene]hyd...)
Affinity DataIC50:  3.75E+4nMpH: 7.0 T: 2°C. Assay description: BRAF kinase activity was quantified using an ELISA-based MEK phosphorylation assay. IC50 values were derived from the sigmoidal dose-response curve f...
In DepthDetails ArticlePubMed