BDBM254474 US9468661, 52
SMILES NC(=O)c1nn(CC(=O)N2[C@@H]3C[C@]3(CO)C[C@H]2C(=O)NC[C@H]2CC2(Cl)Cl)c2ccccc12
InChI Key InChIKey=OBJVWOHIHRKSJE-OOGZCYTASA-N
Data  1 IC50
  Tab Delimited (TSV)   2D SDfile   Computed 3D by Vconf -m prep SDfile
Find this compound or compounds like it in BindingDB:
Activity Spreadsheet -- Enzyme Inhibition Constant Data from BindingDB
Found 1 hit for monomerid = 254474
TargetComplement factor D(Homo sapiens (Human))
Novartis
US Patent
LigandPNGBDBM254474(US9468661, 52)
Affinity DataIC50:  56nMpH: 7.5 T: 2°C. Assay description: Method 1: Recombinant human factor D (expressed in E. coli and purified using standard methods) at 10 nM concentration is incubated with test compoun...
Ligand InfoPC cidPC sid
In DepthDetails US Patent