BDBM254501 US9468661, 79::US9468661, 81
SMILES CC1[C@H](CNC(=O)[C@@H]2C[C@H]3C[C@H]3N2C(=O)Cn2nc(C(N)=O)c3ccncc23)C1(Cl)Cl
InChI Key InChIKey=GZCVDKPVTVOYQX-HHMAYPONSA-N
Data  2 IC50
  Tab Delimited (TSV)   2D SDfile   Computed 3D by Vconf -m prep SDfile
Find this compound or compounds like it in BindingDB:
Activity Spreadsheet -- Enzyme Inhibition Constant Data from BindingDB
Found 2 hits for monomerid = 254501
TargetComplement factor D(Homo sapiens (Human))
Novartis
US Patent
LigandPNGBDBM254501(US9468661, 79 | US9468661, 81)
Affinity DataIC50:  21nMpH: 7.5 T: 2°C. Assay description: Method 1: Recombinant human factor D (expressed in E. coli and purified using standard methods) at 10 nM concentration is incubated with test compoun...
Ligand InfoPC cidPC sid
In DepthDetails US Patent
TargetComplement factor D(Homo sapiens (Human))
Novartis
US Patent
LigandPNGBDBM254501(US9468661, 79 | US9468661, 81)
Affinity DataIC50:  229nMpH: 7.5 T: 2°C. Assay description: Method 1: Recombinant human factor D (expressed in E. coli and purified using standard methods) at 10 nM concentration is incubated with test compoun...
Ligand InfoPC cidPC sid
In DepthDetails US Patent