BDBM254512 US9468661, 90
SMILES CC1CCC(CNC(=O)[C@@H]2C[C@H]3C[C@H]3N2C(=O)Cn2nc(C(N)=O)c3ccccc23)C1
InChI Key InChIKey=SZOPBXHFHLQTQI-YRIPVTTJSA-N
Data  1 IC50
  Tab Delimited (TSV)   2D SDfile   Computed 3D by Vconf -m prep SDfile
Find this compound or compounds like it in BindingDB:
Activity Spreadsheet -- Enzyme Inhibition Constant Data from BindingDB
Found 1 hit for monomerid = 254512
TargetComplement factor D(Homo sapiens (Human))
Novartis
US Patent
LigandPNGBDBM254512(US9468661, 90)
Affinity DataIC50:  53nMpH: 7.5 T: 2°C. Assay description: Method 1: Recombinant human factor D (expressed in E. coli and purified using standard methods) at 10 nM concentration is incubated with test compoun...
Ligand InfoPC cidPC sid
In DepthDetails US Patent